{"text_format":"1","workbook":"xlsx","n_sheets":10,"sheets":["Presentación","Guía","E.Datos","E.Datos2","Metano","RESULTADOS PRTR","Result. N","Calculos","F.EE.","F.Dist."],"not_rendered":{"charts":0,"images":7,"macros":1,"external_links":0,"defined_names":1,"comments":0,"pivot_tables":0},"unopened":[],"bounds":{"document_bytes":16777216,"sheet_cells":100000,"rows_first":2000,"rows_last":500,"rows_between":2000,"halvings":0,"cell_chars":16384,"cell_head_chars":4096},"cells_cut":0,"cells_raw":0,"read":"whole","date_system":"1900"}

{"sheet":"Presentación","index":0,"n_rows":0,"n_cols":0,"rows_kept":0,"cut":false,"hidden":false,"merged":[]}

{"sheet":"Guía","index":1,"n_rows":50,"n_cols":17,"rows_kept":50,"cut":false,"hidden":false,"merged":[[14,16,15,16],[28,16,29,16],[32,16,33,16],[34,16,35,16],[30,16,31,16],[18,16,19,16],[20,16,21,16],[22,16,23,16],[24,16,25,16]]}
[]
[]
[]
[]
[]
[]
[]
[]
[]
[]
{"$rows_left_out":41}
{"sheet":"E.Datos","index":2,"n_rows":49,"n_cols":28,"rows_kept":49,"cut":false,"hidden":false,"merged":[[3,1,4,3],[5,1,6,3],[7,1,8,3],[9,1,10,3],[48,13,48,15],[29,13,29,15],[25,13,25,15],[27,13,27,15],[24,13,24,15],[26,13,26,15],[28,13,28,15],[30,13,30,15],[31,13,31,15],[32,13,32,15],[33,13,33,15],[34,13,34,15],[28,21,28,23],[26,21,26,23],[21,17,21,19],[21,9,22,9],[11,1,12,3],[13,1,14,3],[21,1,49,1],[21,2,22,3],[21,4,22,4],[21,7,22,7],[28,2,28,3],[16,2,16,3],[17,11,17,21],[21,13,21,15],[23,13,23,15],[49,13,49,15],[21,27,22,27],[24,2,24,3],[26,2,26,3],[21,25,22,25],[3,4,4,9],[3,11,3,21],[4,11,6,21],[8,11,8,21],[15,1,15,3],[18,23,18,27],[14,23,15,27],[21,21,22,23],[23,21,23,23],[24,21,24,23],[14,11,14,21],[15,11,15,21],[0,0,2,28],[40,21,40,23],[42,21,42,23],[44,21,44,23],[46,21,46,23],[30,21,30,23],[32,21,32,23],[34,21,34,23],[36,21,36,23],[38,21,38,23],[12,23,13,27],[7,23,8,27],[9,23,10,27],[12,11,13,21],[10,11,10,21],[4,23,6,27],[40,13,40,15],[41,13,41,15],[42,13,42,15],[35,13,35,15],[36,13,36,15],[37,13,37,15],[38,13,38,15],[39,13,39,15]]}
["GANADO AVIAR: AVES DE PUESTA"]
[]
[]
[null,null,null,null,"IDENTIFICACION DE LA EXPLOTACION",null,null,null,null,null,null,"Fase 1. Alojamiento de animales y Evacuación del estiércol",null,null,null,null,null,null,null,null,null,null,null,"Proteína bruta: "]
[null,null,null,null,null,null,null,null,null,null,null,"Si se aplica un mismo sistema de alojamiento para todos los animales, marcar la misma opción en todas las categorías. En caso contrario, diferenciar por categoría.",null,null,null,null,null,null,null,null,null,null,null,"Marcar si la proteina bruta que se suministra habitualmente en la ración está o no dentro de los rangos indicados, en unidades de Kg de P.B. por animal y año."]
[]
[null,"EXPLOTACIÓN",null,null,"NOMBRE"]
[null,null,null,null,null,null,null,null,null,null,null,null,null,null,null,null,null,null,null,null,null,null,null,"Aportación de paja, serrín, virutas u otros materiales para cama:"]
[null,null,null,null,"Nº REGISTRO REGA",null,null,null,null,null,null,"Fase 2. Almacenamiento del estiércol en la granja"]
[null,null,null,null,null,null,null,null,null,null,null,null,null,null,null,null,null,null,null,null,null,null,null,"Indicar la cantidad total de estos materiales, expresada en kg, que se utiliza por término medio por plaza y año."]
{"$rows_left_out":40}
{"sheet":"E.Datos2","index":3,"n_rows":24,"n_cols":5,"rows_kept":24,"cut":false,"hidden":false,"merged":[[22,1,22,3],[22,4,22,6],[23,4,23,6],[17,0,22,0],[17,1,17,6],[19,1,19,3],[19,4,19,6],[20,1,20,3],[20,4,20,6],[21,1,21,3],[21,4,21,6],[10,1,12,2],[10,3,12,6],[1,1,1,6],[3,1,3,2],[3,3,3,6],[5,1,5,6],[6,1,6,2],[6,3,6,6],[7,1,7,2],[7,3,7,6],[8,1,8,2],[8,3,8,6],[9,3,9,6]]}
[]
[null,"                                    IDENTIFICACIÓN PROVINCIA"]
[]
[null,"Provincia de ubicación"]
[]
[null,"                                    Persona que realiza la declaración"]
[null,"Nombre y apellidos"]
[null,"Teléfono"]
[null,"Correo electrónico"]
[]
{"$rows_left_out":15}
{"sheet":"Metano","index":4,"n_rows":11,"n_cols":6,"rows_kept":11,"cut":false,"hidden":true,"merged":[[1,1,2,9],[3,1,4,9],[10,1,10,2]]}
[]
[null,"CÁLCULO SOBRE LAS EMISIÓNES EN AVES DE CORRAL"]
[]
[null,"EMISIÓN DE METANO POR GESTIÓN DE ESTIÉRCOL"]
[]
[]
[null,"Provincia","Factor de\n Conversión*",null,"Provincia",{"$f":"E.Datos2!D4","v":0}]
[null,"Valencia",0.10344,null,"Factor de emisión",{"$f":"IF(F7=\"Provincia\",0,VLOOKUP(F7,$B$8:$C$10,2,0))","v":{"$error":"#N/A"}}]
[null,"Alicante",0.10378,null,"nº de plazas",{"$f":"E.Datos2!E24","v":""}]
[null,"Castellón de la Plana",9.9320000000000006E-2,null,"Emisión de CH4",{"$f":"F8*F9","v":{"$error":"#N/A"}}]
{"$rows_left_out":2}
{"sheet":"RESULTADOS PRTR","index":5,"n_rows":21,"n_cols":3,"rows_kept":21,"cut":false,"hidden":false,"merged":[]}
[]
[null,"EMISIONES A NOTIFICAR EN PRTR-ESPAÑA"]
[null,"Sustancia","kg/año"]
[null,"Amoniaco (NH3)",{"$f":"IF(Calculos!BK16=0,\"\",Calculos!BK16)","v":""}]
[null,"Óxido nitroso (N2O)",{"$f":"IF(Calculos!AO16=0,\"\",Calculos!AO16)","v":""}]
[null,"Óxidos de nitrógeno (NOx)",{"$f":"IF(Calculos!AQ16=0,\"\",Calculos!AQ16)","v":""}]
[null,"Metano (CH4)",{"$f":"IFERROR(IF(Metano!F10=0,\"\",Metano!F10),\"\")","v":""}]
[]
[]
[]
{"$rows_left_out":12}
{"sheet":"Result. N","index":6,"n_rows":37,"n_cols":12,"rows_kept":37,"cut":false,"hidden":true,"merged":[[31,8,31,9],[31,6,31,7],[30,6,30,7],[0,2,2,11],[3,5,3,11],[19,3,19,10],[28,3,28,10],[30,8,30,10],[22,6,22,10],[21,4,21,5],[21,6,21,11],[36,3,36,10],[37,3,37,10],[32,6,32,7],[32,8,32,9],[33,8,33,9],[34,8,34,9],[35,8,35,9],[33,6,33,7],[34,6,34,7],[35,6,35,7],[33,3,33,5],[34,3,34,5],[35,3,35,5]]}
[null,null,"GANADO AVIAR: AVES DE PUESTA"]
[]
[]
[null,null,null,null,null,"IDENTIFICACION DE LA EXPLOTACION"]
[null,null,null,null,null,"NOMBRE"]
[]
[null,null,null,null,null,"Nº REGISTRO REGA"]
[]
[null,null,null,null,null,"RESPONSABLE"]
[]
{"$rows_left_out":28}
{"sheet":"Calculos","index":7,"n_rows":40,"n_cols":64,"rows_kept":40,"cut":false,"hidden":true,"merged":[[25,62,26,62],[24,34,24,36],[24,37,24,45],[24,46,24,47],[24,48,24,52],[24,53,24,54],[0,0,2,0],[0,1,2,1],[0,2,1,2],[24,55,24,56],[25,61,26,61],[24,11,24,16],[24,17,24,22],[24,23,24,26],[24,27,24,30],[24,31,24,33],[24,0,26,0],[24,1,26,1],[24,2,25,2],[24,3,24,7],[24,8,24,10],[1,61,2,61],[1,62,2,62],[0,3,0,7],[0,8,0,10],[0,31,0,33],[0,34,0,36],[0,55,0,56],[0,53,0,54],[0,46,0,47],[0,48,0,52],[0,11,0,16],[0,17,0,22],[0,23,0,26],[0,27,0,30],[0,37,0,45]]}
["SPECIE","CAT_AA","N_AA","N excreted",null,null,null,null,"N Distribution",null,null,"GRAZING",null,null,null,null,null,"YARD_solid",null,null,null,null,null,"BUILD",null,null,null,"STRAW_exBUILD_solid  (kgN)",null,null,null,"DISTRIBUTION_exBUILD_solid",null,null,"DISTRIBUCION_YARD_solid",null,null,"STORE_solid (kg N)",null,null,null,null,null,null,null,null,"DISTRIBUCION_STORE_solid",null,"FIELD_solid",null,null,null,null,"FIELD TOTAL",null,"OTHERS",null,"EE N-NH3 TOTAL","EE N-N2O","EE N-N2","EE N-NOx","EE N-TOTAL","EE-NH3"]
[null,null,null,"Nex_T / AA","Nex_Urine","Nex_T","x_TAN-T","TAN-T","x_GRAZ","x_YARD","x_BUILD","N_GRAZ","TAN_GRAZ","EE_GRAZ","N_ret_GRAZ","TAN_GRAZING_solid","CHECK-1","N_YARD_solid","TAN_YARD_solid","EE_YARD_solid","N_ret_YARD","TAN_YARD_solid","CHECK-2","N_BUILD_solid","TAN_BUILD_solid","CHECK-3","EE_BUILD_solid","N_STRAW","N_exBUILD_solid ","TAN_exBUILD_solid","CHECK-4","x_exBUILD_solid-to-STORE_solid","x_exBUILD_solid-to-FIELD_solid","x_exBUILD_solid-to-OTHER","x_YARD-to-STORE_solid","x_YARD-to-FIELD_solid","x_YARD-to-OTHERS","N_STORE_solid","TAN_STORE_solid","EE_NH3_STORE_solid","EE_N2O_STORE_solid","EE_N2_STORE_solid","EE_NOx_STORE_solid","N_ex_STORE_solid","TAN_ex_STORE_solid","CHECK-5","x_STORE_solid-to-FIELD_solid","x_STORE_slurry-to-OTHERS","N_FIELD_solid","TAN_FIELD_solid","EE_FIELD_solid","N_ex_FIELD_solid","TAN_ex_FIELD_solid","N_ex_SFIELD_total","TAN_ex_FIELD_total","N_OTHERS_solid","TAN_total","(PM=17)","(PM=44,03)","(PM=28,01)","(PM=30,01)","kg N","kg NH3","CHECK"]
[null,null,"nº plazas","kg N/AA","kg N-NH3/AA","kg N","kg N-TAN/AA","kg N-TAN",null,null,null,"Kg N","Kg N-NH3","kg  N-NH3","Kg N","kg  N-NH3",null,"Kg N","Kg N-NH3","kg  N-NH3","Kg N","kg  N-NH3",null,"Kg N","kg  N-NH3",null,"kg  N-NH3","kg N / AA","N_ret_BUILD_solid","TAN_ret_BUILD_solid",null,null,null,null,null,null,null,null,null,"kg  N-NH3","kg  N2O","kg  N2","kg  NOx","N_ret_STORE_solid","TAN_ret_STORE_solid",null,null,null,"kg N ","kg","kg N-NH3","N_ret_FIELD_solid","TAN_ret_FIELD_solid","N_ret_FIELD_total","TAN_ret_FIELD_total","kg N ","kg","kg N","kg N","kg N","kg N"]
["AVES PUESTA","Pollitas blancas en jaula",{"$f":"E.Datos!$E$25","v":0},0.28299999999999997,0.22800000000000001,{"$f":"C4*D4","v":0},{"$f":"E4/D4","v":0.80565371024734989},{"$f":"F4*G4","v":0},{"$f":"'F.Dist.'!$E$4","v":0},{"$f":"'F.Dist.'!$F$4","v":0},{"$f":"'F.Dist.'!$G$4","v":1},{"$f":"F4*I4","v":0},{"$f":"H4*I4","v":0},{"$f":"M4*'F.EE.'!E3","v":0},{"$f":"L4-N4","v":0},{"$f":"M4-N4","v":0},{"$f":"(I4*H4)-(N4+P4)","v":0},{"$f":"F4*J4","v":0},{"$f":"H4*J4","v":0},{"$f":"S4*'F.EE.'!H3","v":0},{"$f":"R4-T4","v":0},{"$f":"S4-T4","v":0},{"$f":"U4+T4+O4+N4-(F4*I4+F4*J4)","v":0},{"$f":"F4*K4","v":0},{"$f":"H4*K4","v":0},{"$f":"(Y4)-H4*K4","v":0},{"$f":"Y4*'F.EE.'!K3","v":0},{"$f":"'F.Dist.'!$J$4","v":0},{"$f":"(C4*AB4*K4)+X4-AA4","v":0},{"$f":"(Y4-AA4)*(1-0.0067)","v":0},{"$f":"(AC4+U4+O4)+(N4+T4+AA4)-(F4+AB4*C4*K4)","v":0},{"$f":"'F.Dist.'!K4","v":1},{"$f":"'F.Dist.'!L4","v":0},{"$f":"'F.Dist.'!M4","v":0},{"$f":"'F.Dist.'!O4","v":0},{"$f":"'F.Dist.'!P4","v":0},{"$f":"'F.Dist.'!Q4","v":0},{"$f":"AC4*AF4+U4*AI4","v":0},{"$f":"AD4*AF4+V4*AI4","v":0},{"$f":"AM4*'F.EE.'!N3","v":0},{"$f":"AM4*'F.EE.'!S3","v":0},{"$f":"AM4*'F.EE.'!T3","v":0},{"$f":"AM4*'F.EE.'!U3","v":0},{"$f":"AL4-AN4-AO4*(28/44)-AP4-AQ4*(14/46)","v":0},{"$f":"AM4-AN4-AO4*(28/44)-AP4-AQ4*(14/46)","v":0},{"$f":"(AR4+AN4+AP4+AO4*28/44+AQ4*14/46)-AL4","v":0},{"$f":"'F.Dist.'!S4","v":1},{"$f":"'F.Dist.'!T4","v":0},{"$f":"AR4*AU4+AC4*AG4+U4*AJ4","v":0},{"$f":"AS4*AU4+AD4*AG4+V4*AJ4","v":0},{"$f":"AX4*'F.EE.'!Q3","v":0},{"$f":"AW4-AY4","v":0},{"$f":"AX4-AY4","v":0},{"$f":"AZ4+O4","v":0},{"$f":"BA4+P4","v":0},{"$f":"U4*AK4+AR4*AV4+AC4*AH4","v":0},{"$f":"V4*AK4+AS4*AV4+AD4*AH4","v":0},{"$f":"AY4+AN4+AA4+T4+N4","v":0},{"$f":"AO4*28/44","v":0},{"$f":"AP4","v":0},{"$f":"AQ4*14/46","v":0},{"$f":"SUM(BF4:BI4)","v":0},{"$f":"BF4*17/14","v":0},{"$f":"F4+(AB4*C4*K4)-(BB4+BD4+BJ4)","v":0}]
["AVES PUESTA","Gallinas blancas en jaula - 1er ciclo",{"$f":"E.Datos!$E$27","v":0},0.57299999999999995,0.44,0,{"$f":"E5/D5","v":0.76788830715532297},{"$f":"F5*G5","v":0},{"$f":"'F.Dist.'!$E$5","v":0},{"$f":"'F.Dist.'!$F$5","v":0},{"$f":"'F.Dist.'!$G$5","v":1},{"$f":"F5*I5","v":0},{"$f":"H5*I5","v":0},{"$f":"M5*'F.EE.'!E4","v":0},{"$f":"L5-N5","v":0},{"$f":"M5-N5","v":0},{"$f":"(I5*H5)-(N5+P5)","v":0},{"$f":"F5*J5","v":0},{"$f":"H5*J5","v":0},{"$f":"S5*'F.EE.'!H4","v":0},{"$f":"R5-T5","v":0},{"$f":"S5-T5","v":0},{"$f":"U5+T5+O5+N5-(F5*I5+F5*J5)","v":0},{"$f":"F5*K5","v":0},{"$f":"H5*K5","v":0},{"$f":"(Y5)-H5*K5","v":0},{"$f":"Y5*'F.EE.'!K4","v":0},{"$f":"'F.Dist.'!$J$5","v":0},{"$f":"(C5*AB5*K5)+X5-AA5","v":0},{"$f":"(Y5-AA5)*(1-0.0067)","v":0},0,{"$f":"'F.Dist.'!K5","v":1},{"$f":"'F.Dist.'!L5","v":0},{"$f":"'F.Dist.'!M5","v":0},{"$f":"'F.Dist.'!O5","v":0},{"$f":"'F.Dist.'!P5","v":0},{"$f":"'F.Dist.'!Q5","v":0},{"$f":"AC5*AF5+U5*AI5","v":0},{"$f":"AD5*AF5+V5*AI5","v":0},{"$f":"AM5*'F.EE.'!N4","v":0},{"$f":"AM5*'F.EE.'!S4","v":0},{"$f":"AM5*'F.EE.'!T4","v":0},{"$f":"AM5*'F.EE.'!U4","v":0},{"$f":"AL5-AN5-AO5*(28/44)-AP5-AQ5*(14/46)","v":0},{"$f":"AM5-AN5-AO5*(28/44)-AP5-AQ5*(14/46)","v":0},{"$f":"(AR5+AN5+AP5+AO5*28/44+AQ5*14/46)-AL5","v":0},{"$f":"'F.Dist.'!S5","v":1},{"$f":"'F.Dist.'!T5","v":0},{"$f":"AR5*AU5+AC5*AG5+U5*AJ5","v":0},{"$f":"AS5*AU5+AD5*AG5+V5*AJ5","v":0},{"$f":"AX5*'F.EE.'!Q4","v":0},{"$f":"AW5-AY5","v":0},{"$f":"AX5-AY5","v":0},{"$f":"AZ5+O5","v":0},{"$f":"BA5+P5","v":0},{"$f":"U5*AK5+AR5*AV5+AC5*AH5","v":0},{"$f":"V5*AK5+AS5*AV5+AD5*AH5","v":0},{"$f":"AY5+AN5+AA5+T5+N5","v":0},{"$f":"AO5*28/44","v":0},{"$f":"AP5","v":0},{"$f":"AQ5*14/46","v":0},{"$f":"SUM(BF5:BI5)","v":0},{"$f":"BF5*17/14","v":0},0]
["AVES PUESTA","Gallinas blancas en jaula - 1er ciclo (muda)",{"$f":"E.Datos!$E$29","v":0},0.56999999999999995,0.43099999999999999,0,0.756140350877193,0,{"$f":"'F.Dist.'!E46","v":0},{"$f":"'F.Dist.'!$F$6","v":0},{"$f":"'F.Dist.'!$G$6","v":1},0,0,{"$f":"M6*'F.EE.'!E5","v":0},0,0,0,0,0,{"$f":"S6*'F.EE.'!H5","v":0},0,0,0,0,0,0,{"$f":"Y6*'F.EE.'!K5","v":0},{"$f":"'F.Dist.'!$J$6","v":0},0,0,0,{"$f":"'F.Dist.'!K6","v":1},{"$f":"'F.Dist.'!L6","v":0},{"$f":"'F.Dist.'!M6","v":0},{"$f":"'F.Dist.'!O6","v":0},{"$f":"'F.Dist.'!P6","v":0},{"$f":"'F.Dist.'!Q6","v":0},0,0,{"$f":"AM6*'F.EE.'!N5","v":0},{"$f":"AM6*'F.EE.'!S5","v":0},{"$f":"AM6*'F.EE.'!T5","v":0},{"$f":"AM6*'F.EE.'!U5","v":0},0,0,0,{"$f":"'F.Dist.'!S6","v":1},{"$f":"'F.Dist.'!T6","v":0},0,0,{"$f":"AX6*'F.EE.'!Q5","v":0},0,0,0,0,0,0,0,0,0,0,0,0,0]
["AVES PUESTA","Gallinas blancas en jaula - muda",{"$f":"E.Datos!$E$31","v":0},0.621,0.53300000000000003,0,0.85829307568438007,0,{"$f":"'F.Dist.'!$E$7","v":0},{"$f":"'F.Dist.'!$F$7","v":0},{"$f":"'F.Dist.'!$G$7","v":1},0,0,{"$f":"M7*'F.EE.'!E6","v":0},0,0,0,{"$f":"F7*J7","v":0},0,{"$f":"S7*'F.EE.'!H6","v":0},0,0,0,0,0,0,{"$f":"Y7*'F.EE.'!K6","v":0},{"$f":"'F.Dist.'!$J$7","v":0},0,0,0,{"$f":"'F.Dist.'!K7","v":1},{"$f":"'F.Dist.'!L7","v":0},{"$f":"'F.Dist.'!M7","v":0},{"$f":"'F.Dist.'!O7","v":0},{"$f":"'F.Dist.'!P7","v":0},{"$f":"'F.Dist.'!Q7","v":0},0,0,{"$f":"AM7*'F.EE.'!N6","v":0},{"$f":"AM7*'F.EE.'!S6","v":0},{"$f":"AM7*'F.EE.'!T6","v":0},{"$f":"AM7*'F.EE.'!U6","v":0},0,0,0,{"$f":"'F.Dist.'!S7","v":1},{"$f":"'F.Dist.'!T7","v":0},0,0,{"$f":"AX7*'F.EE.'!Q6","v":0},0,0,0,0,0,0,0,0,0,0,0,0,0]
["AVES PUESTA","Gallinas blancas en jaula - 2º ciclo",{"$f":"E.Datos!$E$33","v":0},0.60199999999999998,0.46200000000000002,0,0.76744186046511631,0,{"$f":"'F.Dist.'!$E$8","v":0},{"$f":"'F.Dist.'!$F$8","v":0},{"$f":"'F.Dist.'!$G$8","v":1},0,0,{"$f":"M8*'F.EE.'!E7","v":0},0,0,0,0,0,{"$f":"S8*'F.EE.'!H7","v":0},0,0,0,0,0,0,{"$f":"Y8*'F.EE.'!K7","v":0},{"$f":"'F.Dist.'!$J$8","v":0},0,0,0,{"$f":"'F.Dist.'!K8","v":1},{"$f":"'F.Dist.'!L8","v":0},{"$f":"'F.Dist.'!M8","v":0},{"$f":"'F.Dist.'!O8","v":0},{"$f":"'F.Dist.'!P8","v":0},{"$f":"'F.Dist.'!Q8","v":0},0,0,{"$f":"AM8*'F.EE.'!N7","v":0},{"$f":"AM8*'F.EE.'!S7","v":0},{"$f":"AM8*'F.EE.'!T7","v":0},{"$f":"AM8*'F.EE.'!U7","v":0},0,0,0,{"$f":"'F.Dist.'!S8","v":1},{"$f":"'F.Dist.'!T8","v":0},0,0,{"$f":"AX8*'F.EE.'!Q7","v":0},0,0,0,0,0,0,{"$f":"AY8+AN8+AA8+T8+N8","v":0},0,0,0,0,0,0]
["AVES PUESTA","Pollitas rubias en jaula",{"$f":"E.Datos!$E$35","v":0},0.31,0.249,0,0.8032258064516129,0,{"$f":"'F.Dist.'!$E$9","v":0},{"$f":"'F.Dist.'!$F$9","v":0},{"$f":"'F.Dist.'!$G$9","v":1},0,0,{"$f":"M9*'F.EE.'!E8","v":0},0,0,0,0,0,{"$f":"S9*'F.EE.'!H8","v":0},0,0,0,0,0,0,{"$f":"Y9*'F.EE.'!K8","v":0},{"$f":"'F.Dist.'!$J$9","v":0},0,0,0,{"$f":"'F.Dist.'!K9","v":1},{"$f":"'F.Dist.'!L9","v":0},{"$f":"'F.Dist.'!M9","v":0},{"$f":"'F.Dist.'!O9","v":0},{"$f":"'F.Dist.'!P9","v":0},{"$f":"'F.Dist.'!Q9","v":0},0,0,{"$f":"AM9*'F.EE.'!N8","v":0},{"$f":"AM9*'F.EE.'!S8","v":0},{"$f":"AM9*'F.EE.'!T8","v":0},{"$f":"AM9*'F.EE.'!U8","v":0},0,0,0,{"$f":"'F.Dist.'!S9","v":1},{"$f":"'F.Dist.'!T9","v":0},0,0,{"$f":"AX9*'F.EE.'!Q8","v":0},0,0,0,0,0,0,0,0,0,0,0,0,0]
["AVES PUESTA","Gallinas rubias en jaula - 1er ciclo",{"$f":"E.Datos!$E$37","v":0},0.64100000000000001,0.49399999999999999,0,0.77067082683307331,0,{"$f":"'F.Dist.'!$E$10","v":0},{"$f":"'F.Dist.'!$F$10","v":0},{"$f":"'F.Dist.'!$G$10","v":1},0,0,{"$f":"M10*'F.EE.'!E9","v":0},0,0,0,0,0,{"$f":"S10*'F.EE.'!H9","v":0},0,0,0,0,0,0,{"$f":"Y10*'F.EE.'!K9","v":0},{"$f":"'F.Dist.'!$J$10","v":0},0,0,0,{"$f":"'F.Dist.'!K10","v":1},{"$f":"'F.Dist.'!L10","v":0},{"$f":"'F.Dist.'!M10","v":0},{"$f":"'F.Dist.'!O10","v":0},{"$f":"'F.Dist.'!P10","v":0},{"$f":"'F.Dist.'!Q10","v":0},0,0,{"$f":"AM10*'F.EE.'!N9","v":0},{"$f":"AM10*'F.EE.'!S9","v":0},{"$f":"AM10*'F.EE.'!T9","v":0},{"$f":"AM10*'F.EE.'!U9","v":0},0,0,0,{"$f":"'F.Dist.'!S10","v":1},{"$f":"'F.Dist.'!T10","v":0},0,0,{"$f":"AX10*'F.EE.'!Q9","v":0},0,0,0,0,0,0,0,0,0,0,0,0,0]
{"$rows_left_out":31}
{"sheet":"F.EE.","index":8,"n_rows":49,"n_cols":21,"rows_kept":49,"cut":false,"hidden":true,"merged":[[0,1,1,1],[0,0,1,0],[0,14,0,16],[0,2,0,4],[0,18,0,20],[0,5,0,7],[0,8,0,10],[0,11,0,13]]}
["SPECIE","CAT_AA","GRAZING",null,null,"YARD_solid",null,null,"BUILD-solid",null,null,"STORAGE_solid",null,null,"APPLIED_ solid",null,null,null,"STORAGE_solid"]
[null,null,"FE_GRAZING\nEFTIER I","FR_GRAZING","Fec_GRAZING","FE_YARD_solid","FR_YARD_solid","Fec_YARD_solid","FE_BUILD_solid","FR_BUILD_solid","FEc_BUILD_solid","FE_STORAGE_solid","FR_STORAGE_solid","FEc_STORAGE_solid","FE_APPLIED_solid","FR_APPLIED_solid","FEc_APPLIED_solid",null,"kg N2O","kg N2","kg NO"]
["AVES PUESTA","Pollitas blancas en jaula",0.32,1,{"$f":"C3*D3","v":0.32},{"$f":"I3","v":0.28000000000000003},1,{"$f":"F3*G3","v":0.28000000000000003},0.28000000000000003,{"$f":"VLOOKUP(E.Datos!J25,'F.EE.'!$B$20:$H$34,7,FALSE)","v":1},{"$f":"I3*J3","v":0.28000000000000003},0.17,{"$f":"VLOOKUP(E.Datos!V25,'F.EE.'!$K$20:$O$21,5,FALSE)","v":1},{"$f":"L3*M3","v":0.17},0.66,{"$f":"VLOOKUP(E.Datos!AB25,'F.EE.'!$K$29:$O$33,5,FALSE)","v":1},{"$f":"O3*P3","v":0.66},null,2E-3,0.3,0.01]
["AVES PUESTA","Gallinas blancas en jaula - 1er ciclo",0.32,1,{"$f":"C4*D4","v":0.32},{"$f":"I4","v":0.41},1,{"$f":"F4*G4","v":0.41},0.41,{"$f":"VLOOKUP(E.Datos!J27,'F.EE.'!$B$20:$H$34,7,FALSE)","v":1},{"$f":"I4*J4","v":0.41},0.14000000000000001,{"$f":"VLOOKUP(E.Datos!V27,'F.EE.'!$K$20:$O$21,5,FALSE)","v":1},{"$f":"L4*M4","v":0.14000000000000001},0.69,{"$f":"VLOOKUP(E.Datos!AB27,'F.EE.'!$K$29:$O$33,5,FALSE)","v":1},{"$f":"O4*P4","v":0.69},null,2E-3,0.3,0.01]
["AVES PUESTA","Gallinas blancas en jaula - 1er ciclo (muda)",0.32,1,0.32,0.41,1,0.41,0.41,{"$f":"VLOOKUP(E.Datos!J29,'F.EE.'!$B$20:$H$34,7,FALSE)","v":1},0.41,0.14000000000000001,{"$f":"VLOOKUP(E.Datos!V29,'F.EE.'!$K$20:$O$21,5,FALSE)","v":1},0.14000000000000001,0.69,{"$f":"VLOOKUP(E.Datos!AB29,'F.EE.'!$K$29:$O$33,5,FALSE)","v":1},0.69,null,2E-3,0.3,0.01]
["AVES PUESTA","Gallinas blancas en jaula - muda",0.32,1,0.32,0.41,1,0.41,0.41,{"$f":"VLOOKUP(E.Datos!J31,'F.EE.'!$B$20:$H$34,7,FALSE)","v":1},0.41,0.14000000000000001,{"$f":"VLOOKUP(E.Datos!V31,'F.EE.'!$K$20:$O$21,5,FALSE)","v":1},0.14000000000000001,0.69,{"$f":"VLOOKUP(E.Datos!AB31,'F.EE.'!$K$29:$O$33,5,FALSE)","v":1},0.69,null,2E-3,0.3,0.01]
["AVES PUESTA","Gallinas blancas en jaula - 2º ciclo",0.32,1,0.32,0.41,1,0.41,0.41,{"$f":"VLOOKUP(E.Datos!J33,'F.EE.'!$B$20:$H$34,7,FALSE)","v":1},0.41,0.14000000000000001,{"$f":"VLOOKUP(E.Datos!V33,'F.EE.'!$K$20:$O$21,5,FALSE)","v":1},0.14000000000000001,0.69,{"$f":"VLOOKUP(E.Datos!AB33,'F.EE.'!$K$29:$O$33,5,FALSE)","v":1},0.69,null,2E-3,0.3,0.01]
["AVES PUESTA","Pollitas rubias en jaula",0.32,1,0.32,0.28000000000000003,1,0.28000000000000003,0.28000000000000003,{"$f":"VLOOKUP(E.Datos!J35,'F.EE.'!$B$20:$H$34,7,FALSE)","v":1},0.28000000000000003,0.17,{"$f":"VLOOKUP(E.Datos!V35,'F.EE.'!$K$20:$O$21,5,FALSE)","v":1},0.17,0.66,{"$f":"VLOOKUP(E.Datos!AB35,'F.EE.'!$K$29:$O$33,5,FALSE)","v":1},0.66,null,2E-3,0.3,0.01]
["AVES PUESTA","Gallinas rubias en jaula - 1er ciclo",0.32,1,0.32,0.41,1,0.41,0.41,{"$f":"VLOOKUP(E.Datos!J37,'F.EE.'!$B$20:$H$34,7,FALSE)","v":1},0.41,0.14000000000000001,{"$f":"VLOOKUP(E.Datos!V37,'F.EE.'!$K$20:$O$21,5,FALSE)","v":1},0.14000000000000001,0.69,{"$f":"VLOOKUP(E.Datos!AB37,'F.EE.'!$K$29:$O$33,5,FALSE)","v":1},0.69,null,2E-3,0.3,0.01]
["AVES PUESTA","Gallinas rubias en jaula - 1er ciclo (muda)",0.32,1,0.32,0.41,1,0.41,0.41,{"$f":"VLOOKUP(E.Datos!J39,'F.EE.'!$B$20:$H$34,7,FALSE)","v":1},0.41,0.14000000000000001,{"$f":"VLOOKUP(E.Datos!V39,'F.EE.'!$K$20:$O$21,5,FALSE)","v":1},0.14000000000000001,0.69,{"$f":"VLOOKUP(E.Datos!AB39,'F.EE.'!$K$29:$O$33,5,FALSE)","v":1},0.69,null,2E-3,0.3,0.01]
{"$rows_left_out":40}
{"sheet":"F.Dist.","index":9,"n_rows":33,"n_cols":20,"rows_kept":33,"cut":false,"hidden":true,"merged":[[0,18,0,19],[1,17,2,17],[0,9,1,9],[1,13,2,13],[0,7,0,8],[1,7,2,7],[1,8,2,8],[0,10,0,12],[0,14,0,17],[19,11,19,13],[0,0,2,0],[0,1,2,1],[0,2,1,2],[0,4,0,6],[1,4,2,4],[1,5,2,5],[1,6,2,6]]}
["SPECIE","CAT_AA","x_TAN-T","GROSS PROTEIN","DISTRIBUTION_Excrete",null,null,"DISTRIBUTION_BUILD",null,"N_Straw","DISTRIBUTION_exBUILD_solid",null,null,null,"DISTRIBUTION_YARD_solid",null,null,null,"DISTRIBUTION_STORE_solid"]
[null,null,null,"SÍ","x_GRAZ","x_YARD","x_BUILD","X_BUILD_solid","X_BUILD_slurry",null,"x_exBUILD_solid-to-STORE_solid","x_exBUILD_solid-to-FIELD_solid","x_exBUILD_solid-to-OTHERS","CHECK","x_YARD-to-STORE_solid","x_YARD-to-FIELD_solid","x_YARD-to-OTHERS","CHECK","x_STORE_solid-to-FIELD_solid","x_STORE_solid-to-OTHERS"]
[null,null,"kg N-TAN/AA","NO",null,null,null,null,null,"kg N / AA"]
["AVES PUESTA","Pollitas blancas en jaula",{"$f":"Calculos!G4","v":0.80565371024734989},{"$f":"E.Datos!H25","v":"SÍ"},0,0,{"$f":"1-E4-F4","v":1},1,{"$f":"1-H4","v":0},{"$f":"IF(E.Datos!E25=0,0,(E.Datos!L25/E.Datos!E25)*'F.Dist.'!J28)","v":0},{"$f":"IF(E.Datos!R25=Guía!I47,1,0)","v":1},{"$f":"IF(E.Datos!R25=Guía!I48,1,0)","v":0},{"$f":"IF(E.Datos!R25=Guía!I49,1,0)","v":0},{"$f":"SUM(K4:M4)","v":1},{"$f":"IF(E.Datos!T25=Guía!I47,1,0)","v":0},{"$f":"IF(E.Datos!T25=Guía!I48,1,0)","v":0},{"$f":"IF(E.Datos!T25=Guía!I49,1,0)","v":0},{"$f":"SUM(O4:Q4)","v":0},{"$f":"IF(E.Datos!Z25=Guía!I48,1,0)","v":1},{"$f":"IF(E.Datos!Z25=Guía!I49,1,0)","v":0}]
["AVES PUESTA","Gallinas blancas en jaula - 1er ciclo",{"$f":"Calculos!G5","v":0.76788830715532297},{"$f":"E.Datos!H27","v":"SÍ"},0,0,{"$f":"1-E5-F5","v":1},1,0,{"$f":"IF(E.Datos!E27=0,0,(E.Datos!L27/E.Datos!E27)*'F.Dist.'!J28)","v":0},{"$f":"IF(E.Datos!R27=Guía!I47,1,0)","v":1},{"$f":"IF(E.Datos!R27=Guía!I48,1,0)","v":0},{"$f":"IF(E.Datos!R27=Guía!I49,1,0)","v":0},{"$f":"SUM(K5:M5)","v":1},{"$f":"IF(E.Datos!T27=Guía!I47,1,0)","v":0},{"$f":"IF(E.Datos!T27=Guía!I48,1,0)","v":0},{"$f":"IF(E.Datos!T27=Guía!I49,1,0)","v":0},{"$f":"SUM(O5:Q5)","v":0},{"$f":"IF(E.Datos!Z27=Guía!I48,1,0)","v":1},{"$f":"IF(E.Datos!Z27=Guía!I49,1,0)","v":0}]
["AVES PUESTA","Gallinas blancas en jaula - 1er ciclo (muda)",{"$f":"Calculos!G6","v":0.756140350877193},{"$f":"E.Datos!H29","v":"SÍ"},0,0,{"$f":"1-E6-F6","v":1},1,0,{"$f":"IF(E.Datos!E29=0,0,(E.Datos!L29/E.Datos!E29)*'F.Dist.'!J28)","v":0},{"$f":"IF(E.Datos!R29=Guía!I47,1,0)","v":1},{"$f":"IF(E.Datos!R29=Guía!I48,1,0)","v":0},{"$f":"IF(E.Datos!R29=Guía!I49,1,0)","v":0},1,{"$f":"IF(E.Datos!T29=Guía!I47,1,0)","v":0},{"$f":"IF(E.Datos!T29=Guía!I48,1,0)","v":0},{"$f":"IF(E.Datos!T29=Guía!I49,1,0)","v":0},0,{"$f":"IF(E.Datos!Z29=Guía!I48,1,0)","v":1},{"$f":"IF(E.Datos!Z29=Guía!I49,1,0)","v":0}]
["AVES PUESTA","Gallinas blancas en jaula - muda",{"$f":"Calculos!G7","v":0.85829307568438007},{"$f":"E.Datos!H31","v":"SÍ"},0,0,1,1,0,{"$f":"IF(E.Datos!E31=0,0,(E.Datos!L31/E.Datos!E31)*'F.Dist.'!J28)","v":0},{"$f":"IF(E.Datos!R31=Guía!I47,1,0)","v":1},{"$f":"IF(E.Datos!R31=Guía!I48,1,0)","v":0},{"$f":"IF(E.Datos!R31=Guía!I49,1,0)","v":0},1,{"$f":"IF(E.Datos!T31=Guía!I47,1,0)","v":0},{"$f":"IF(E.Datos!T31=Guía!I48,1,0)","v":0},{"$f":"IF(E.Datos!T31=Guía!I49,1,0)","v":0},0,{"$f":"IF(E.Datos!Z31=Guía!I48,1,0)","v":1},{"$f":"IF(E.Datos!Z31=Guía!I49,1,0)","v":0}]
["AVES PUESTA","Gallinas blancas en jaula - 2º ciclo",{"$f":"Calculos!G8","v":0.76744186046511631},{"$f":"E.Datos!H33","v":"SÍ"},0,0,1,1,0,{"$f":"IF(E.Datos!E33=0,0,(E.Datos!L33/E.Datos!E33)*'F.Dist.'!J28)","v":0},{"$f":"IF(E.Datos!R33=Guía!I47,1,0)","v":1},{"$f":"IF(E.Datos!R33=Guía!I48,1,0)","v":0},{"$f":"IF(E.Datos!R33=Guía!I49,1,0)","v":0},1,{"$f":"IF(E.Datos!T33=Guía!I47,1,0)","v":0},{"$f":"IF(E.Datos!T33=Guía!I48,1,0)","v":0},{"$f":"IF(E.Datos!T33=Guía!I49,1,0)","v":0},0,{"$f":"IF(E.Datos!Z33=Guía!I48,1,0)","v":1},{"$f":"IF(E.Datos!Z33=Guía!I49,1,0)","v":0}]
["AVES PUESTA","Pollitas rubias en jaula",{"$f":"Calculos!G9","v":0.8032258064516129},{"$f":"E.Datos!H35","v":"SÍ"},0,0,1,1,0,{"$f":"IF(E.Datos!E35=0,0,(E.Datos!L35/E.Datos!E35)*'F.Dist.'!J28)","v":0},{"$f":"IF(E.Datos!R35=Guía!I47,1,0)","v":1},{"$f":"IF(E.Datos!R35=Guía!I48,1,0)","v":0},{"$f":"IF(E.Datos!R35=Guía!I49,1,0)","v":0},1,{"$f":"IF(E.Datos!T35=Guía!I47,1,0)","v":0},{"$f":"IF(E.Datos!T35=Guía!I48,1,0)","v":0},{"$f":"IF(E.Datos!T35=Guía!I49,1,0)","v":0},0,{"$f":"IF(E.Datos!Z35=Guía!I48,1,0)","v":1},{"$f":"IF(E.Datos!Z35=Guía!I49,1,0)","v":0}]
["AVES PUESTA","Gallinas rubias en jaula - 1er ciclo",{"$f":"Calculos!G10","v":0.77067082683307331},{"$f":"E.Datos!H37","v":"SÍ"},0,0,1,1,0,{"$f":"IF(E.Datos!E37=0,0,(E.Datos!L37/E.Datos!E37)*'F.Dist.'!J28)","v":0},{"$f":"IF(E.Datos!R37=Guía!I47,1,0)","v":1},{"$f":"IF(E.Datos!R37=Guía!I48,1,0)","v":0},{"$f":"IF(E.Datos!R37=Guía!I49,1,0)","v":0},1,{"$f":"IF(E.Datos!T37=Guía!I47,1,0)","v":0},{"$f":"IF(E.Datos!T37=Guía!I48,1,0)","v":0},{"$f":"IF(E.Datos!T37=Guía!I49,1,0)","v":0},0,{"$f":"IF(E.Datos!Z37=Guía!I48,1,0)","v":1},{"$f":"IF(E.Datos!Z37=Guía!I49,1,0)","v":0}]
{"$rows_left_out":23}