{"text_format":"1","workbook":"xlsx","n_sheets":10,"sheets":["Presentación","Instrucciones","E.Datos","E.Datos2","Metano","Resultados PRTR","Result. N","Calculos","F.EE.","F.Dist."],"not_rendered":{"charts":0,"images":8,"macros":1,"external_links":1,"defined_names":1,"comments":0,"pivot_tables":0},"unopened":[],"bounds":{"document_bytes":16777216,"sheet_cells":100000,"rows_first":2000,"rows_last":500,"rows_between":2000,"halvings":0,"cell_chars":16384,"cell_head_chars":4096},"cells_cut":0,"cells_raw":0,"read":"whole","date_system":"1900"}

{"sheet":"Presentación","index":0,"n_rows":0,"n_cols":0,"rows_kept":0,"cut":false,"hidden":false,"merged":[]}

{"sheet":"Instrucciones","index":1,"n_rows":67,"n_cols":17,"rows_kept":67,"cut":false,"hidden":false,"merged":[[1,0,2,13],[66,7,66,14],[4,0,4,13],[6,0,6,13],[16,0,16,13],[7,0,7,13]]}
[]
["En la pestaña  “E.Datos” (Entrada de datos) deben introducirse los datos del complejo. Además, en la comuna E donde se especifíca el número de animales al año hay que introducir el número de plazas que haya en la explotación."]
[]
[]
["Si en su instalación conviven cerdos de diferentes categorías productivas, debe dividir el número de plazas entre el número de categorías que existan en su instalación. "]
[]
{"$rows_left_out":62}
{"sheet":"E.Datos","index":2,"n_rows":53,"n_cols":23,"rows_kept":53,"cut":false,"hidden":false,"merged":[[7,1,8,3],[8,4,8,6],[8,7,8,9],[9,1,10,3],[10,4,10,6],[10,7,10,9],[0,1,2,9],[3,1,4,3],[3,4,4,9],[5,1,6,3],[6,4,6,6],[6,7,6,9],[11,1,12,3],[12,4,12,6],[12,7,12,9],[13,1,14,3],[14,4,14,6],[14,7,14,9],[21,1,53,1],[21,2,22,3],[21,4,22,4],[21,6,22,6],[21,7,22,7],[30,2,30,3],[42,2,42,3],[28,2,28,3],[32,2,32,3],[34,2,34,3],[36,2,36,3],[38,2,38,3],[50,2,50,3],[21,11,22,11],[21,17,22,17],[21,22,22,22],[24,2,24,3],[26,2,26,3],[21,9,22,9],[21,15,22,15],[15,11,15,17],[40,2,40,3],[44,2,44,3],[46,2,46,3],[48,2,48,3],[17,4,17,6],[17,7,17,9],[18,7,18,9],[15,1,15,3],[15,4,15,6],[15,7,15,9],[16,2,16,3],[16,4,16,9],[16,11,16,23],[21,19,21,20],[23,19,23,20],[2,11,2,17],[12,11,14,17],[10,11,11,17],[8,11,8,17],[11,18,12,23],[13,18,14,23],[4,18,6,22],[8,18,10,22]]}
[null,"GANADO PORCINO"]
[null,null,null,null,null,null,null,null,null,null,null,"Proteína bruta: ",null,null,null,null,null,null,"Separación sólido-líquido: "]
[null,null,null,null,null,null,null,null,null,null,null,"Marcar si la proteina bruta que se suministra habitualmente en la ración está o no dentro de los rangos.",null,null,null,null,null,null,"Marcar si se separa la fracción sólida de la fracción líquida en las deyecciones."]
[null,null,null,null,"IDENTIFICACION DE LA EXPLOTACION",null,null,null,null,null,null,"Grupo 1. Alojamiento de animales",null,null,null,null,null,null,"Destino de los purines:"]
[null,null,null,null,null,null,null,null,null,null,null,"Si se aplica un mismo sistema de alojamiento para todos los animales, marcar la misma opción en todas las categorías. En caso contrario, diferenciar por categoría.",null,null,null,null,null,null,"Indicar el destino del purín o el estiércol procedente de la explotación: el que se recoge en la nave de alojamiento y el que se saca del almacén de purines. "]
[]
{"$rows_left_out":48}
{"sheet":"E.Datos2","index":3,"n_rows":30,"n_cols":5,"rows_kept":30,"cut":false,"hidden":false,"merged":[[17,0,28,0],[47,2,47,3],[48,2,48,3],[19,1,19,3],[20,1,20,3],[21,1,21,3],[22,1,22,3],[23,1,23,3],[24,1,24,3],[25,1,25,3],[26,1,26,3],[28,1,28,3],[27,1,27,3],[3,1,3,2],[3,3,3,6],[1,1,1,6],[17,1,17,6],[5,1,5,6],[6,1,6,2],[6,3,6,6],[7,1,7,2],[7,3,7,6],[8,1,8,2],[8,3,8,6],[9,3,9,6],[10,1,12,2],[10,3,12,6],[19,4,19,6],[20,4,20,6],[21,4,21,6],[22,4,22,6],[23,4,23,6],[29,4,29,6],[24,4,24,6],[25,4,25,6],[26,4,26,6],[27,4,27,6],[28,4,28,6]]}
[]
[null,"                                    IDENTIFICACIÓN PROVINCIA"]
[]
[null,"Provincia de ubicación",null,"Provincia"]
[]
[null,"                                    Persona que realiza la declaración"]
{"$rows_left_out":25}
{"sheet":"Metano","index":4,"n_rows":40,"n_cols":10,"rows_kept":40,"cut":false,"hidden":true,"merged":[[108,1,108,2],[109,1,109,2],[110,1,110,2],[3,1,4,9],[1,1,2,9],[102,1,102,2],[103,1,103,2],[104,1,104,2],[105,1,105,2],[106,1,106,2],[107,1,107,2],[94,1,94,2],[95,1,95,2],[96,1,96,2],[97,1,97,2],[100,1,101,2],[100,4,100,5],[87,4,87,5],[89,1,89,2],[90,1,90,2],[91,1,91,2],[92,1,92,2],[93,1,93,2],[87,1,88,2],[80,1,80,2],[81,1,81,2],[82,1,82,2],[83,1,83,2],[84,1,84,2],[57,4,57,5],[59,1,59,2],[60,1,60,2],[61,1,61,2],[79,1,79,2],[63,1,63,2],[64,1,64,2],[65,1,65,2],[66,1,66,2],[67,1,67,2],[71,1,71,5],[74,1,75,2],[74,4,74,5],[76,1,76,2],[77,1,77,2],[78,1,78,2],[62,1,62,2],[49,1,49,2],[50,1,50,2],[51,1,51,2],[52,1,52,2],[53,1,53,2],[54,1,54,2],[57,1,58,2],[48,1,48,2],[33,1,33,2],[34,1,34,2],[35,1,35,2],[36,1,36,2],[37,1,37,2],[38,1,38,2],[22,1,22,2],[28,1,29,2],[30,1,30,2],[31,1,31,2],[32,1,32,2],[25,0,26,5],[21,1,21,2],[10,1,10,2],[12,1,13,2],[14,1,14,2],[15,1,15,2],[16,1,16,2],[17,1,17,2],[18,1,18,2],[19,1,19,2],[20,1,20,2]]}
[]
[null,"CÁLCULO SOBRE LAS EMISIÓNES EN GANADO PORCINO"]
[]
[null,"EMISIÓN DE METANO POR GESTIÓN DE ESTIÉRCOL"]
[]
[]
{"$rows_left_out":35}
{"sheet":"Resultados PRTR","index":5,"n_rows":21,"n_cols":3,"rows_kept":21,"cut":false,"hidden":false,"merged":[]}
[]
[null,"EMISIONES A NOTIFICAR EN PRTR-ESPAÑA"]
[null,"Sustancia","kg/año"]
[null,"Amoniaco (NH3)",{"$f":"IF(Calculos!CO18=0,\"\",Calculos!CO18)","v":""}]
[null,"Óxido nitroso (N2O)",{"$f":"IF(Calculos!BB18+Calculos!BL18=0,\"\",Calculos!BB18+Calculos!BL18)","v":""}]
[null,"Óxidos de nitrógeno (NOx)",{"$f":"IF(Calculos!BD18+Calculos!BN18=0,\"\",Calculos!BD18+Calculos!BN18)","v":""}]
{"$rows_left_out":16}
{"sheet":"Result. N","index":6,"n_rows":37,"n_cols":13,"rows_kept":37,"cut":false,"hidden":true,"merged":[[31,9,31,10],[31,7,31,8],[30,7,30,8],[0,3,2,12],[3,6,3,12],[19,4,19,11],[28,4,28,11],[30,9,30,11],[22,7,22,11],[21,7,21,12],[21,5,21,6],[36,4,36,11],[37,4,37,11],[32,7,32,8],[32,9,32,10],[33,9,33,10],[34,9,34,10],[35,9,35,10],[33,7,33,8],[34,7,34,8],[35,7,35,8],[33,4,33,6],[34,4,34,6],[35,4,35,6]]}
[null,null,null,"GANADO PORCINO"]
[]
[]
[null,null,null,null,null,null,"IDENTIFICACION DE LA EXPLOTACION"]
[null,null,null,null,null,null,"NOMBRE"]
[]
{"$rows_left_out":32}
{"sheet":"Calculos","index":7,"n_rows":47,"n_cols":94,"rows_kept":47,"cut":false,"hidden":true,"merged":[[0,50,0,58],[0,0,2,0],[0,1,2,1],[0,2,1,2],[0,10,0,15],[0,16,0,21],[1,91,2,91],[1,92,2,92],[0,3,0,6],[0,7,0,9],[0,37,0,40],[0,41,0,45],[0,46,0,49],[0,31,0,35],[0,22,0,30],[0,85,0,86],[0,83,0,84],[0,59,0,66],[0,69,0,70],[0,71,0,72],[0,73,0,77],[0,78,0,82],[29,0,31,0],[29,1,31,1],[29,2,30,2],[29,3,29,6],[29,7,29,9],[29,10,29,15],[29,16,29,21],[29,22,29,30],[29,31,29,35],[29,37,29,40],[29,41,29,45],[29,46,29,49],[29,50,29,58],[29,59,29,66],[29,69,29,70],[30,91,31,91],[30,92,31,92],[29,71,29,72],[29,73,29,77],[29,78,29,82],[29,83,29,84],[29,85,29,86]]}
["SPECIE","CAT_AA","N_AA","N excreted",null,null,null,"N Distribution",null,null,"GRAZING",null,null,null,null,null,"YARD_solid+slurry",null,null,null,null,null,"BUILD",null,null,null,null,null,null,null,null,"STRAW_exBUILD_solid  (kgN)",null,null,null,null,null,"DISTRIBUTION_exBUILD_solid",null,null,null,"DISTRIBUTION_BUILD_slurry",null,null,null,null,"DISTRIBUCION_YARD_solid+slurry (=YARD)",null,null,null,"STORE_solid (kg N)",null,null,null,null,null,null,null,null,"STORE_slurry  (kg N)",null,null,null,null,null,null,null,null,null,"DISTRIBUCION_STORE_solid",null,"DISTRIBUCION_STORE_slurry",null,"FIELD_solid",null,null,null,null,"FIELD_slurry",null,null,null,null,"FIELD TOTAL",null,"OTHERS",null,"EE N-NH3 TOTAL","EE N-N2O","EE N-N2","EE N-NOx","EE N-TOTAL","EE-NH3"]
[null,null,null,"Nex_T / AA","Nex_T","x_TAN-T","TAN-T","x_GRAZ","x_YARD","x_BUILD","N_GRAZ","TAN_GRAZ","EE_GRAZ","N_ret_GRAZ","TAN_GRAZING_solid+slurry","CHECK-1","N_YARD_solid+slurry","TAN_YARD_solid+slurry","EE_YARD_solid+slurry","N_ret_YARD","TAN_YARD_solid+slurry","CHECK-2","X_BUILD_solid","X_BUILD_slurry","N_BUILD_solid","N_BUILD_slurry","TAN_BUILD_solid","TAN_BUILD_slurry","CHECK-3","EE_BUILD_solid","EE_BUILD_slurry","N_STRAW","N_exBUILD_solid ","TAN_exBUILD_solid","N_ex_BUILD_slurry","TAN_ex_BUILD_slurry","CHECK-4","x_exBUILD_solid-to-STORE_solid","x_exBUILD_solid-to-STORE_slurry","x_exBUILD_solid-to-FIELD_solid","x_exBUILD_solid-to-OTHER","x_BUILD_slurry-to-STORE_solid","x_BUILD_slurry-to-STORE_slurry","x_BUILD_slurry-to-FIELD_solid","x_BUILD_slurry-to-FIELD_slurry","x_BUILD_slurry-to-OTHERS","x_YARD-to-STORE_solid","x_YARD-to-STORE_slurry","x_YARD-to-FIELD_solid","x_YARD-to-OTHERS","N_STORE_solid","TAN_STORE_solid","EE_NH3_STORE_solid","EE_N2O_STORE_solid","EE_N2_STORE_solid","EE_NOx_STORE_solid","N_ex_STORE_solid","TAN_ex_STORE_solid","CHECK-5","N_STORE_slurry","TAN_STORE_slurry","minTAN_STORE_slurry","EE_NH3_STORE_slurry","EE_N2O_STORE_slurry","EE_N2_STORE_slurry","EE_NOx_STORE_slurry","N_ex_STORE_slurry","TAN_ex_STORE_slurry","CHECK-6","x_STORE_solid-to-FIELD_solid","x_STORE_slurry-to-OTHERS","x_STORE_slurry-to-FIELD_slurry","x_STORE_slurry-to-OTHERS","N_FIELD_solid","TAN_FIELD_solid","EE_FIELD_solid","N_ex_FIELD_solid","TAN_ex_FIELD_solid","N_FIELD_slurry","TAN_FIELD_slurry","EE_FIELD_slurry","N_ex_SFIELD_slurry","TAN_ex_FIELD_slurry","N_ex_SFIELD_total","TAN_ex_FIELD_total","N_OTHERS_solid","TAN_total","(PM=17)","(PM=44)","(PM=28)","(PM=46)","kg N","kg NH3","CHECK"]
[null,null,"nº animals","kg N/AA","kg N","kg N-TAN/AA","kg N-TAN",null,null,null,"Kg N","Kg N-NH3","kg  N-NH3","Kg N","kg  N-NH3",null,"Kg N","Kg N-NH3","kg  N-NH3","Kg N","kg  N-NH3",null,null,null,"Kg N","Kg N","kg  N-NH3","kg  N-NH3",null,"kg  N-NH3","kg  N-NH3","kg N / AA","N_ret_BUILD_solid","TAN_ret_BUILD_solid","N_ret_BUILD_slurry","TAN_ret_BUILD_slurry",null,null,null,null,null,null,null,null,null,null,null,null,null,null,null,null,"kg  N-NH3","kg  N2O","kg  N2","kg  NOx","N_ret_STORE_solid","TAN_ret_STORE_solid",null,null,null,null,"kg  N-NH3","kg  N2O","kg  N2","kg  NOx","N_ret_STORE_slurry","TAN_ret_STORE_slurry",null,null,null,null,null,"kg N ","kg","kg N-NH3","N_ret_FIELD_solid","TAN_ret_FIELD_solid","kg N ","kg","kg N-NH3","N_ret_FIELD_slurry","TAN_ret_FIELD_slurry","N_ret_FIELD_total","TAN_ret_FIELD_total","kg N ","kg","kg N","kg N","kg N","kg N"]
["CERDO","Lechones destetados ",{"$f":"E.Datos!E25","v":0},3.45,{"$f":"C4*D4","v":0},{"$f":"'F.Dist.'!D4","v":0.73623188405797102},{"$f":"E4*F4","v":0},{"$f":"'F.Dist.'!E4","v":0},{"$f":"'F.Dist.'!F4","v":0},{"$f":"'F.Dist.'!G4","v":1},{"$f":"E4*H4","v":0},{"$f":"G4*H4","v":0},{"$f":"L4*'F.EE.'!F3","v":0},{"$f":"K4-M4","v":0},{"$f":"L4-M4","v":0},{"$f":"(H4*G4)-(M4+O4)","v":0},{"$f":"E4*I4","v":0},{"$f":"G4*I4","v":0},{"$f":"R4*'F.EE.'!I3","v":0},{"$f":"Q4-S4","v":0},{"$f":"R4-S4","v":0},{"$f":"T4+S4+N4+M4-(E4*H4+E4*I4)","v":0},{"$f":"'F.Dist.'!H4","v":0},{"$f":"'F.Dist.'!I4","v":1},{"$f":"E4*J4*W4","v":0},{"$f":"E4*J4*X4","v":0},{"$f":"G4*J4*W4","v":0},{"$f":"G4*J4*X4","v":0},{"$f":"(AA4+AB4)-G4*J4","v":0},{"$f":"AA4*'F.EE.'!M3","v":0},{"$f":"AB4*'F.EE.'!Q3","v":0},{"$f":"'F.Dist.'!J4","v":0},{"$f":"(C4*AF4*J4*W4)+Y4-AD4","v":0},{"$f":"(AA4-AD4)*(1-0.0067)","v":0},{"$f":"Z4-AE4","v":0},{"$f":"AB4-AE4","v":0},{"$f":"(AG4+AI4+T4+N4)+(M4+S4+AD4+AE4)-(E4+AF4*C4*J4*W4)","v":0},{"$f":"'F.Dist.'!L4","v":0},{"$f":"'F.Dist.'!M4","v":0},{"$f":"'F.Dist.'!N4","v":0},{"$f":"'F.Dist.'!O4","v":0},{"$f":"'F.Dist.'!R4","v":0},{"$f":"'F.Dist.'!S4","v":1},{"$f":"'F.Dist.'!U4","v":0},{"$f":"'F.Dist.'!V4","v":0},{"$f":"'F.Dist.'!W4","v":0},{"$f":"'F.Dist.'!Y4","v":0},{"$f":"'F.Dist.'!Z4","v":0},{"$f":"'F.Dist.'!AA4","v":0},{"$f":"'F.Dist.'!AB4","v":0},{"$f":"AG4*AL4+T4*AU4+AI4*AP4","v":0},{"$f":"AH4*AL4+AJ4*AP4+U4*AU4","v":0},{"$f":"AZ4*'F.EE.'!T3","v":0},{"$f":"(AZ4*'F.EE.'!AE3)","v":0},{"$f":"(AZ4*'F.EE.'!AF3)","v":0},{"$f":"(AZ4*'F.EE.'!AG3)","v":0},{"$f":"AY4-BA4-BB4*(28/44)-BC4-BD4*(14/46)","v":0},{"$f":"AZ4-BA4-BB4*(28/44)-BC4-BD4*(14/46)","v":0},{"$f":"(BE4+BA4+BC4+BB4*28/44+BD4*14/46)-AY4","v":0},{"$f":"AG4*AM4+AI4*AQ4+T4*AV4","v":0},{"$f":"AH4*AM4+AJ4*AQ4+U4*AV4","v":0},{"$f":"BI4+(BH4-BI4)*0.1","v":0},{"$f":"BJ4*'F.EE.'!W3","v":0},{"$f":"BJ4*'F.EE.'!AH3","v":0},{"$f":"BJ4*'F.EE.'!AI3","v":0},{"$f":"BJ4*'F.EE.'!AJ3","v":0},{"$f":"BH4-BK4-BL4*(28/44)-BM4-BN4*(14/46)","v":0},{"$f":"BJ4-BK4-BL4*(28/44)-BM4-BN4*(14/46)","v":0},{"$f":"(BO4+BK4+BM4+BL4*28/44+BN4*14/46)-BH4","v":0},{"$f":"'F.Dist.'!AD4","v":0},{"$f":"'F.Dist.'!AE4","v":1},{"$f":"'F.Dist.'!AF4","v":0},{"$f":"'F.Dist.'!AG4","v":1},{"$f":"BE4*BR4+AG4*AN4+AI4*AR4+T4*AW4","v":0},{"$f":"BF4*BR4+AH4*AN4+AJ4*AR4+U4*AW4","v":0},{"$f":"BW4*'F.EE.'!Z3","v":0},{"$f":"BV4-BX4","v":0},{"$f":"BW4-BX4","v":0},{"$f":"AI4*AS4+BO4*BT4","v":0},{"$f":"AJ4*AS4+BP4*BT4","v":0},{"$f":"CB4*'F.EE.'!AC3","v":0},{"$f":"CA4-CC4","v":0},{"$f":"CB4-CC4","v":0},{"$f":"CD4+BY4+N4","v":0},{"$f":"CE4+BZ4+O4","v":0},{"$f":"T4*AX4+BO4*BU4+BE4*BS4+AI4*AT4+AG4*AO4","v":0},{"$f":"U4*AX4+BP4*BU4+BF4*BS4+AJ4*AT4+AH4*AO4","v":0},{"$f":"CC4+BX4+BK4+BA4+AE4+AD4+S4+M4","v":0},{"$f":"(BL4+BB4)*28/44","v":0},{"$f":"(BM4+BC4)","v":0},{"$f":"(BN4+BD4)*14/46","v":0},{"$f":"SUM(CJ4:CM4)","v":0},{"$f":"CJ4*17/14","v":0},{"$f":"(E4+(AF4*C4*J4*W4)-(CH4+CN4+CF4))","v":0}]
["CERDO","Cerdo 20-49 kg",{"$f":"E.Datos!E27","v":0},8.81,{"$f":"C5*D5","v":0},{"$f":"'F.Dist.'!D5","v":0.72077185017026102},{"$f":"E5*F5","v":0},{"$f":"'F.Dist.'!E5","v":0},{"$f":"'F.Dist.'!F5","v":0},{"$f":"'F.Dist.'!G5","v":1},{"$f":"E5*H5","v":0},{"$f":"G5*H5","v":0},{"$f":"L5*'F.EE.'!F4","v":0},{"$f":"K5-M5","v":0},{"$f":"L5-M5","v":0},{"$f":"(H5*G5)-(M5+O5)","v":0},{"$f":"E5*I5","v":0},{"$f":"G5*I5","v":0},{"$f":"R5*'F.EE.'!I4","v":0},{"$f":"Q5-S5","v":0},{"$f":"R5-S5","v":0},{"$f":"T5+S5+N5+M5-(E5*H5+E5*I5)","v":0},{"$f":"'F.Dist.'!H5","v":0},{"$f":"'F.Dist.'!I5","v":1},{"$f":"E5*J5*W5","v":0},{"$f":"E5*J5*X5","v":0},{"$f":"G5*J5*W5","v":0},{"$f":"G5*J5*X5","v":0},{"$f":"(AA5+AB5)-G5*J5","v":0},{"$f":"AA5*'F.EE.'!M4","v":0},{"$f":"AB5*'F.EE.'!Q4","v":0},{"$f":"'F.Dist.'!J5","v":0},{"$f":"(C5*AF5*J5*W5)+Y5-AD5","v":0},{"$f":"(AA5-AD5)*(1-0.0067)","v":0},{"$f":"Z5-AE5","v":0},{"$f":"AB5-AE5","v":0},{"$f":"(AG5+AI5+T5+N5)+(M5+S5+AD5+AE5)-(E5+AF5*C5*J5*W5)","v":0},{"$f":"'F.Dist.'!L5","v":0},{"$f":"'F.Dist.'!M5","v":0},{"$f":"'F.Dist.'!N5","v":0},{"$f":"'F.Dist.'!O5","v":0},{"$f":"'F.Dist.'!R5","v":0},{"$f":"'F.Dist.'!S5","v":1},{"$f":"'F.Dist.'!U5","v":0},{"$f":"'F.Dist.'!V5","v":0},{"$f":"'F.Dist.'!W5","v":0},{"$f":"'F.Dist.'!Y5","v":0},{"$f":"'F.Dist.'!Z5","v":0},{"$f":"'F.Dist.'!AA5","v":0},{"$f":"'F.Dist.'!AB5","v":0},{"$f":"AG5*AL5+T5*AU5+AI5*AP5","v":0},{"$f":"AH5*AL5+AJ5*AP5+U5*AU5","v":0},{"$f":"AZ5*'F.EE.'!T4","v":0},{"$f":"(AZ5*'F.EE.'!AE4)","v":0},{"$f":"(AZ5*'F.EE.'!AF4)","v":0},{"$f":"(AZ5*'F.EE.'!AG4)","v":0},0,0,0,{"$f":"AG5*AM5+AI5*AQ5+T5*AV5","v":0},{"$f":"AH5*AM5+AJ5*AQ5+U5*AV5","v":0},{"$f":"BI5+(BH5-BI5)*0.1","v":0},{"$f":"BJ5*'F.EE.'!W4","v":0},{"$f":"BJ5*'F.EE.'!AH4","v":0},{"$f":"BJ5*'F.EE.'!AI4","v":0},{"$f":"BJ5*'F.EE.'!AJ4","v":0},0,0,0,{"$f":"'F.Dist.'!AD5","v":0},{"$f":"'F.Dist.'!AE5","v":1},{"$f":"'F.Dist.'!AF5","v":0},{"$f":"'F.Dist.'!AG5","v":1},{"$f":"BE5*BR5+AG5*AN5+AI5*AR5+T5*AW5","v":0},{"$f":"BF5*BR5+AH5*AN5+AJ5*AR5+U5*AW5","v":0},{"$f":"BW5*'F.EE.'!Z4","v":0},{"$f":"BV5-BX5","v":0},{"$f":"BW5-BX5","v":0},{"$f":"AI5*AS5+BO5*BT5","v":0},{"$f":"AJ5*AS5+BP5*BT5","v":0},{"$f":"CB5*'F.EE.'!AC4","v":0},{"$f":"CA5-CC5","v":0},{"$f":"CB5-CC5","v":0},{"$f":"CD5+BY5+N5","v":0},{"$f":"CE5+BZ5+O5","v":0},{"$f":"T5*AX5+BO5*BU5+BE5*BS5+AI5*AT5+AG5*AO5","v":0},{"$f":"U5*AX5+BP5*BU5+BF5*BS5+AJ5*AT5+AH5*AO5","v":0},{"$f":"CC5+BX5+BK5+BA5+AE5+AD5+S5+M5","v":0},{"$f":"(BL5+BB5)*28/44","v":0},{"$f":"(BM5+BC5)","v":0},0,{"$f":"SUM(CJ5:CM5)","v":0},{"$f":"CJ5*17/14","v":0},{"$f":"(E5+(AF5*C5*J5*W5)-(CH5+CN5+CF5))","v":0}]
["CERDO","Cerdo 50-79 kg",{"$f":"E.Datos!E29","v":0},10.72,{"$f":"C6*D6","v":0},{"$f":"'F.Dist.'!D6","v":0.72108208955223885},{"$f":"E6*F6","v":0},{"$f":"'F.Dist.'!E6","v":0},{"$f":"'F.Dist.'!F6","v":0},{"$f":"'F.Dist.'!G6","v":1},{"$f":"E6*H6","v":0},{"$f":"G6*H6","v":0},{"$f":"L6*'F.EE.'!F5","v":0},{"$f":"K6-M6","v":0},{"$f":"L6-M6","v":0},{"$f":"(H6*G6)-(M6+O6)","v":0},{"$f":"E6*I6","v":0},{"$f":"G6*I6","v":0},{"$f":"R6*'F.EE.'!I5","v":0},{"$f":"Q6-S6","v":0},{"$f":"R6-S6","v":0},{"$f":"T6+S6+N6+M6-(E6*H6+E6*I6)","v":0},{"$f":"'F.Dist.'!H6","v":0},{"$f":"'F.Dist.'!I6","v":1},{"$f":"E6*J6*W6","v":0},{"$f":"E6*J6*X6","v":0},{"$f":"G6*J6*W6","v":0},{"$f":"G6*J6*X6","v":0},{"$f":"(AA6+AB6)-G6*J6","v":0},{"$f":"AA6*'F.EE.'!M5","v":0},{"$f":"AB6*'F.EE.'!Q5","v":0},{"$f":"'F.Dist.'!J6","v":0},{"$f":"(C6*AF6*J6*W6)+Y6-AD6","v":0},{"$f":"(AA6-AD6)*(1-0.0067)","v":0},{"$f":"Z6-AE6","v":0},{"$f":"AB6-AE6","v":0},{"$f":"(AG6+AI6+T6+N6)+(M6+S6+AD6+AE6)-(E6+AF6*C6*J6*W6)","v":0},{"$f":"'F.Dist.'!L6","v":0},{"$f":"'F.Dist.'!M6","v":0},{"$f":"'F.Dist.'!N6","v":0},{"$f":"'F.Dist.'!O6","v":0},{"$f":"'F.Dist.'!R6","v":0},{"$f":"'F.Dist.'!S6","v":1},{"$f":"'F.Dist.'!U6","v":0},{"$f":"'F.Dist.'!V6","v":0},{"$f":"'F.Dist.'!W6","v":0},{"$f":"'F.Dist.'!Y6","v":0},{"$f":"'F.Dist.'!Z6","v":0},{"$f":"'F.Dist.'!AA6","v":0},{"$f":"'F.Dist.'!AB6","v":0},{"$f":"AG6*AL6+T6*AU6+AI6*AP6","v":0},{"$f":"AH6*AL6+AJ6*AP6+U6*AU6","v":0},{"$f":"AZ6*'F.EE.'!T5","v":0},{"$f":"(AZ6*'F.EE.'!AE5)","v":0},{"$f":"(AZ6*'F.EE.'!AF5)","v":0},{"$f":"(AZ6*'F.EE.'!AG5)","v":0},0,0,0,{"$f":"AG6*AM6+AI6*AQ6+T6*AV6","v":0},{"$f":"AH6*AM6+AJ6*AQ6+U6*AV6","v":0},{"$f":"BI6+(BH6-BI6)*0.1","v":0},{"$f":"BJ6*'F.EE.'!W5","v":0},{"$f":"BJ6*'F.EE.'!AH5","v":0},{"$f":"BJ6*'F.EE.'!AI5","v":0},{"$f":"BJ6*'F.EE.'!AJ5","v":0},0,0,0,{"$f":"'F.Dist.'!AD6","v":0},{"$f":"'F.Dist.'!AE6","v":1},{"$f":"'F.Dist.'!AF6","v":0},{"$f":"'F.Dist.'!AG6","v":1},{"$f":"BE6*BR6+AG6*AN6+AI6*AR6+T6*AW6","v":0},{"$f":"BF6*BR6+AH6*AN6+AJ6*AR6+U6*AW6","v":0},{"$f":"BW6*'F.EE.'!Z5","v":0},{"$f":"BV6-BX6","v":0},{"$f":"BW6-BX6","v":0},{"$f":"AI6*AS6+BO6*BT6","v":0},{"$f":"AJ6*AS6+BP6*BT6","v":0},{"$f":"CB6*'F.EE.'!AC5","v":0},{"$f":"CA6-CC6","v":0},{"$f":"CB6-CC6","v":0},{"$f":"CD6+BY6+N6","v":0},{"$f":"CE6+BZ6+O6","v":0},{"$f":"T6*AX6+BO6*BU6+BE6*BS6+AI6*AT6+AG6*AO6","v":0},{"$f":"U6*AX6+BP6*BU6+BF6*BS6+AJ6*AT6+AH6*AO6","v":0},{"$f":"CC6+BX6+BK6+BA6+AE6+AD6+S6+M6","v":0},{"$f":"(BL6+BB6)*28/44","v":0},{"$f":"(BM6+BC6)","v":0},0,{"$f":"SUM(CJ6:CM6)","v":0},{"$f":"CJ6*17/14","v":0},{"$f":"(E6+(AF6*C6*J6*W6)-(CH6+CN6+CF6))","v":0}]
{"$rows_left_out":42}
{"sheet":"F.EE.","index":8,"n_rows":36,"n_cols":36,"rows_kept":36,"cut":false,"hidden":true,"merged":[[0,30,0,32],[0,33,0,35],[0,6,0,8],[0,9,0,12],[0,13,0,16],[0,17,0,19],[0,20,0,22],[0,2,1,2],[0,1,1,1],[0,0,1,0],[0,23,0,25],[0,26,0,28],[0,3,0,5]]}
["SPECIE","CAT_AA","CAT_EMEP","GRAZING",null,null,"YARD_solid+slurry",null,null,"BUILD-solid",null,null,null,"BUILD_slurry",null,null,null,"STORAGE_solid",null,null,"STORAGE_slurry",null,null,"APPLIED_ solid",null,null,"APPLIED_slurry",null,null,null,"STORAGE_solid",null,null,"STORAGE_slurry"]
[null,null,null,"FE_GRAZING","FR_GRAZING","Fec_GRAZING","FE_YARD_solid+slurry","FR_YARD_solid+slurry","Fec_YARD_solid+slury","FE_BUILD_solid","FR1_BUILD_solid","FR2_BUILD_solid","FEc_BUILD_solid","FE_BUILD_slurry","FR1_BUILD_solid","FR2_BUILD_solid","FEc_BUILD_slurry","FE_STORAGE_solid","FR_STORAGE_solid","FEc_STORAGE_solid","FE_STORAGE_slurry","FR_STORAGE_slurry","FEc_STORAGE_slurry","FE_APPLIED_solid","FR_APPLIED_solid","FEc_APPLIED_solid","FE_APPLIED_slurry","FR_APPLIED_slurry","FEc_APPLIED_slurry",null,"kg N2O","kg N2","kg NO","N2O","N2","NO"]
["CERDO","Lechones destetados ","< 8 kg",0.25,1,{"$f":"D3*E3","v":0.25},null,1,{"$f":"G3*H3","v":0},0.25,1,1,{"$f":"J3*K3*L3","v":0.25},0.22,{"$f":"VLOOKUP(E.Datos!J25,'F.EE.'!$K$22:$P$29,6,FALSE)","v":1},{"$f":"VLOOKUP(E.Datos!L25,'F.EE.'!$K$32:$P$36,6,FALSE)","v":1},{"$f":"N3*O3*P3","v":0.22},0.45,1,{"$f":"R3*S3","v":0.45},0.14000000000000001,{"$f":"VLOOKUP(E.Datos!R25,'F.EE.'!$S$22:$V$33,4,FALSE)","v":1},{"$f":"U3*V3","v":0.14000000000000001},0.81,{"$f":"VLOOKUP(E.Datos!W25,'F.EE.'!$Y$22:$AB$29,4,FALSE)","v":1},{"$f":"X3*Y3","v":0.81},0.28999999999999998,{"$f":"VLOOKUP(E.Datos!W25,'F.EE.'!$Y$22:$AB$29,4,FALSE)","v":1},{"$f":"AA3*AB3","v":0.28999999999999998},null,0.01,0.3,0.01,0,3.0000000000000001E-3,1E-4]
["CERDO","Cerdo 20-49 kg","> 8 kg",0.25,1,{"$f":"D4*E4","v":0.25},0.53,1,{"$f":"G4*H4","v":0.53},0.27,1,1,{"$f":"J4*K4*L4","v":0.27},0.28000000000000003,{"$f":"VLOOKUP(E.Datos!J27,'F.EE.'!$K$22:$P$29,6,FALSE)","v":1},{"$f":"VLOOKUP(E.Datos!L27,'F.EE.'!$K$32:$P$36,6,FALSE)","v":1},{"$f":"N4*O4*P4","v":0.28000000000000003},0.45,1,{"$f":"R4*S4","v":0.45},0.14000000000000001,{"$f":"VLOOKUP(E.Datos!R27,'F.EE.'!$S$22:$V$33,4,FALSE)","v":1},{"$f":"U4*V4","v":0.14000000000000001},0.81,{"$f":"VLOOKUP(E.Datos!W27,'F.EE.'!$Y$22:$AB$29,4,FALSE)","v":1},{"$f":"X4*Y4","v":0.81},0.4,{"$f":"VLOOKUP(E.Datos!W27,'F.EE.'!$Y$22:$AB$29,4,FALSE)","v":1},{"$f":"AA4*AB4","v":0.4},null,0.01,0.3,0.01,0,3.0000000000000001E-3,1E-4]
["CERDO","Cerdo 50-79 kg","> 8 kg",0.25,1,0.25,0.53,1,0.53,0.27,1,1,0.27,0.28000000000000003,{"$f":"VLOOKUP(E.Datos!J29,'F.EE.'!$K$22:$P$29,6,FALSE)","v":1},{"$f":"VLOOKUP(E.Datos!L29,'F.EE.'!$K$32:$P$36,6,FALSE)","v":1},0.28000000000000003,0.45,1,0.45,0.14000000000000001,{"$f":"VLOOKUP(E.Datos!R29,'F.EE.'!$S$22:$V$33,4,FALSE)","v":1},0.14000000000000001,0.81,{"$f":"VLOOKUP(E.Datos!W29,'F.EE.'!$Y$22:$AB$29,4,FALSE)","v":1},0.81,0.4,{"$f":"VLOOKUP(E.Datos!W29,'F.EE.'!$Y$22:$AB$29,4,FALSE)","v":1},{"$f":"AA5*AB5","v":0.4},null,0.01,0.3,0.01,0,3.0000000000000001E-3,1E-4]
["CERDO","Cerdo 80-109 kg","> 8 kg",0.25,1,0.25,0.53,1,0.53,0.27,1,1,0.27,0.28000000000000003,{"$f":"VLOOKUP(E.Datos!J31,'F.EE.'!$K$22:$P$29,6,FALSE)","v":1},{"$f":"VLOOKUP(E.Datos!L31,'F.EE.'!$K$32:$P$36,6,FALSE)","v":1},0.28000000000000003,0.45,1,0.45,0.14000000000000001,{"$f":"VLOOKUP(E.Datos!R31,'F.EE.'!$S$22:$V$33,4,FALSE)","v":1},0.14000000000000001,0.81,{"$f":"VLOOKUP(E.Datos!W31,'F.EE.'!$Y$22:$AB$29,4,FALSE)","v":1},0.81,0.4,{"$f":"VLOOKUP(E.Datos!W31,'F.EE.'!$Y$22:$AB$29,4,FALSE)","v":1},0.4,null,0.01,0.3,0.01,0,3.0000000000000001E-3,1E-4]
{"$rows_left_out":31}
{"sheet":"F.Dist.","index":9,"n_rows":19,"n_cols":36,"rows_kept":19,"cut":false,"hidden":true,"merged":[[0,0,2,0],[0,1,2,1],[0,2,2,2],[0,3,1,3],[0,4,0,6],[1,4,2,4],[1,5,2,5],[1,6,2,6],[0,9,1,9],[1,15,2,15],[0,7,0,8],[1,7,2,7],[1,8,2,8],[0,11,0,14],[0,24,0,28],[1,23,2,23],[0,29,0,30],[0,16,0,23],[0,31,0,32],[1,28,2,28]]}
["SPECIE","CAT_AA","CAT_EMEP","x_TAN-T","DISTRIBUTION_Excrete",null,null,"DISTRIBUTION_BUILD",null,"N_Straw","Separ. S-L","DISTRIBUTION_exBUILD_solid",null,null,null,null,"DISTRIBUTION_exBUILD_slurry",null,null,null,null,null,null,null,"DISTRIBUTION_YARD_solid+slurry",null,null,null,null,"DISTRIBUTION_STORE_solid",null,"DISTRIBUTION_STORE_slurry"]
[null,null,null,null,"x_GRAZ","x_YARD","x_BUILD","X_BUILD_solid","X_BUILD_slurry",null,"SÍ","x_exBUILD_solid-to-STORE_solid","x_exBUILD_solid-to-STORE_slurry","x_exBUILD_solid-to-FIELD_solid","x_exBUILD_solid-to-OTHERS","CHECK","x_exBUILD_slurry-to-STORE","x_exBUILD_slurry-to-STORE_solid","x_exBUILD_slurry-to-STORE_slurry","x_exBUILD_slurry-to-FIELD","x_exBUILD_slurry-to-FIELD_solid","x_exBUILD_slurry-to-FIELD_slurry","x_exBUILD_slurry-to-OTHERS","CHECK","x_YARD-to-STORE_solid","x_YARD-to-STORE_slurry","x_YARD-to-FIELD_solid","x_YARD-to-OTHERS","CHECK","x_STORE_solid-to-FIELD_solid","x_STORE_solid-to-OTHERS","x_STORE_slurry-to-FIELD_slurry","x_STORE_slurry-to-OTHERS"]
[null,null,null,"kg N-TAN/AA",null,null,null,null,null,"kg N / AA","NO"]
["CERDO","Lechones destetados ","< 8 kg",0.73623188405797102,0,0,{"$f":"1-E4-F4","v":1},0,{"$f":"1-H4","v":1},0,{"$f":"E.Datos!N25","v":"NO"},0,0,0,0,{"$f":"SUM(L4:O4)","v":0},{"$f":"IF(E.Datos!P25=\"A almacenamiento\",1,0)","v":1},{"$f":"IF(K4=\"Sí\",0.1*Q4,0)","v":0},{"$f":"IF(K4=\"SÍ\",0.9*Q4,Q4)","v":1},{"$f":"IF(E.Datos!P25=\"Al campo o terreno agrícola\",1,0)","v":0},{"$f":"IF(K4=\"Sí\",0.1*T4,0)","v":0},{"$f":"IF(K4=\"SÍ\",0.9*T4,T4)","v":0},{"$f":"IF(E.Datos!P25=\"A otros usos no agrarios\",1,0)","v":0},{"$f":"1-SUM(R4:S4)-SUM(U4:V4)-W4","v":0},0,0,0,0,{"$f":"SUM(X4:AB4)","v":0},{"$f":"IF(E.Datos!T25=\"Al campo o terreno agrícola\",1,0)","v":0},{"$f":"IF(E.Datos!T25=\"A otros usos no agrarios\",1,0)","v":1},{"$f":"IF(E.Datos!U25=\"Al campo o terreno agrícola\",1,0)","v":0},{"$f":"IF(E.Datos!U25=\"A otros usos no agrarios\",1,0)","v":1}]
["CERDO","Cerdo 20-49 kg","> 8 kg",0.72077185017026102,0,0,{"$f":"1-E5-F5","v":1},0,{"$f":"1-H5","v":1},0,{"$f":"E.Datos!N27","v":"NO"},0,0,0,0,{"$f":"SUM(L5:O5)","v":0},{"$f":"IF(E.Datos!P27=\"A almacenamiento\",1,0)","v":1},{"$f":"IF(K5=\"Sí\",0.1*Q5,0)","v":0},{"$f":"IF(K5=\"SÍ\",0.9*Q5,Q5)","v":1},{"$f":"IF(E.Datos!P27=\"Al campo o terreno agrícola\",1,0)","v":0},{"$f":"IF(K5=\"Sí\",0.1*T5,0)","v":0},{"$f":"IF(K5=\"SÍ\",0.9*T5,T5)","v":0},{"$f":"IF(E.Datos!P27=\"A otros usos no agrarios\",1,0)","v":0},{"$f":"1-SUM(R5:S5)-SUM(U5:V5)-W5","v":0},0,0,0,0,{"$f":"SUM(X5:AB5)","v":0},{"$f":"IF(E.Datos!T27=\"Al campo o terreno agrícola\",1,0)","v":0},{"$f":"IF(E.Datos!T27=\"A otros usos no agrarios\",1,0)","v":1},{"$f":"IF(E.Datos!U27=\"Al campo o terreno agrícola\",1,0)","v":0},{"$f":"IF(E.Datos!U27=\"A otros usos no agrarios\",1,0)","v":1}]
["CERDO","Cerdo 50-79 kg","> 8 kg",0.72108208955223885,0,0,{"$f":"1-E6-F6","v":1},0,1,0,{"$f":"E.Datos!N29","v":"NO"},0,0,0,0,0,{"$f":"IF(E.Datos!P29=\"A almacenamiento\",1,0)","v":1},0,{"$f":"IF(K6=\"SÍ\",0.9*Q6,Q6)","v":1},{"$f":"IF(E.Datos!P29=\"Al campo o terreno agrícola\",1,0)","v":0},0,{"$f":"IF(K6=\"SÍ\",0.9*T6,T6)","v":0},{"$f":"IF(E.Datos!P29=\"A otros usos no agrarios\",1,0)","v":0},0,0,0,0,0,0,{"$f":"IF(E.Datos!T29=\"Al campo o terreno agrícola\",1,0)","v":0},{"$f":"IF(E.Datos!T29=\"A otros usos no agrarios\",1,0)","v":1},{"$f":"IF(E.Datos!U29=\"Al campo o terreno agrícola\",1,0)","v":0},{"$f":"IF(E.Datos!U29=\"A otros usos no agrarios\",1,0)","v":1}]
{"$rows_left_out":13}